Reaction Details
TargetCarbonic anhydrase 13
LigandBDBM50428436
Substrate/Competitorn/a
Meas. Tech.ChEMBL_942126 (CHEMBL2341282)
Ki 27400±n/a nM
Citation Davis, RAVullo, DMaresca, ASupuran, CTPoulsen, SA Natural product coumarins that inhibit human carbonic anhydrases. Bioorg Med Chem21:1539-43 (2013) 
 
Carbonic anhydrase 13
Name:Carbonic anhydrase 13
Type:Enzyme
Mol. Mass.:29445.78
Organism:Homo sapiens (Human)
Description:Q8N1Q1
Residue:262
BDBM50428436
NameBDBM50428436
Synonyms:CHEMBL1995684
TypeSmall organic molecule
Emp. Form.C19H20O5
Mol. Mass.328.3591
SMILESCC(CCOc1ccc2ccc(=O)oc2c1)C1=CC(=O)C(C)(C)O1