Reaction Details
TargetCarbonic anhydrase 1
LigandBDBM50156693
Substrate/Competitorn/a
Meas. Tech.ChEMBL_942131 (CHEMBL2341287)
Ki 10560±n/a nM
Citation Davis, RAVullo, DMaresca, ASupuran, CTPoulsen, SA Natural product coumarins that inhibit human carbonic anhydrases. Bioorg Med Chem21:1539-43 (2013) 
 
Carbonic anhydrase 1
Name:Carbonic anhydrase 1
Type:Enzyme
Mol. Mass.:28873.37
Organism:Homo sapiens (Human)
Description:P00915
Residue:261
BDBM50156693
NameBDBM50156693
Synonyms:6-Methoxy-7-hydroxycoumarin 6-O-Methylesculetin 7-hydroxy-6-methoxy-2H-chromen-2-one scopoletin
TypeSmall organic molecule
Emp. Form.C10H8O4
Mol. Mass.192.1681
SMILESCOc1cc2ccc(=O)oc2cc1O