Reaction Details
TargetCarbonic anhydrase 13
LigandBDBM50292575
Substrate/Competitorn/a
Meas. Tech.ChEMBL_942126 (CHEMBL2341282)
Ki 8360±n/a nM
Citation Davis, RAVullo, DMaresca, ASupuran, CTPoulsen, SA Natural product coumarins that inhibit human carbonic anhydrases. Bioorg Med Chem21:1539-43 (2013) 
 
Carbonic anhydrase 13
Name:Carbonic anhydrase 13
Type:Enzyme
Mol. Mass.:29445.78
Organism:Homo sapiens (Human)
Description:Q8N1Q1
Residue:262
BDBM50292575
NameBDBM50292575
Synonyms:8,8-Dimethyl-8H-pyrano[3,2-g]chromen-2-one XANTHYLETIN | cid_65188
TypeSmall organic molecule
Emp. Form.C14H12O3
Mol. Mass.228.2433
SMILESCC1(C)Oc2cc3oc(=O)ccc3cc2C=C1