Reaction Details
TargetCarbonic anhydrase 1
LigandBDBM50428434
Substrate/Competitorn/a
Meas. Tech.ChEMBL_942131 (CHEMBL2341287)
Ki 7660±n/a nM
Citation Davis, RAVullo, DMaresca, ASupuran, CTPoulsen, SA Natural product coumarins that inhibit human carbonic anhydrases. Bioorg Med Chem21:1539-43 (2013) 
 
Carbonic anhydrase 1
Name:Carbonic anhydrase 1
Type:Enzyme
Mol. Mass.:28873.37
Organism:Homo sapiens (Human)
Description:P00915
Residue:261
BDBM50428434
NameBDBM50428434
Synonyms:CHEMBL2334004
TypeSmall organic molecule
Emp. Form.C20H20O4
Mol. Mass.324.3704
SMILESCOc1c(\C=C\C(C)=C)c2oc(=O)ccc2c2OC(C)(C)C=Cc12