Reaction Details
TargetCarbonic anhydrase 2
LigandBDBM50428438
Substrate/Competitorn/a
Meas. Tech.ChEMBL_942130 (CHEMBL2341286)
Ki>100000±n/a nM
Citation Davis, RAVullo, DMaresca, ASupuran, CTPoulsen, SA Natural product coumarins that inhibit human carbonic anhydrases. Bioorg Med Chem21:1539-43 (2013) 
 
Carbonic anhydrase 2
Name:Carbonic anhydrase 2
Type:Enzyme
Mol. Mass.:29250.71
Organism:Homo sapiens (Human)
Description:P00918
Residue:260
BDBM50428438
NameBDBM50428438
Synonyms:CHEMBL2331585
TypeSmall organic molecule
Emp. Form.C10H8O4
Mol. Mass.192.1681
SMILESCOc1c(O)ccc2ccc(=O)oc12