Reaction Details
TargetCarbonic anhydrase 2
LigandBDBM50428439
Substrate/Competitorn/a
Meas. Tech.ChEMBL_942130 (CHEMBL2341286)
Ki>100000±n/a nM
Citation Davis, RAVullo, DMaresca, ASupuran, CTPoulsen, SA Natural product coumarins that inhibit human carbonic anhydrases. Bioorg Med Chem21:1539-43 (2013) 
 
Carbonic anhydrase 2
Name:Carbonic anhydrase 2
Type:Enzyme
Mol. Mass.:29250.71
Organism:Homo sapiens (Human)
Description:P00918
Residue:260
BDBM50428439
NameBDBM50428439
Synonyms:6,7,8,-Trimethoxycoumarin CHEMBL253551
TypeSmall organic molecule
Emp. Form.C12H12O5
Mol. Mass.236.2207
SMILESCOc1cc2ccc(=O)oc2c(OC)c1OC