Reaction Details
TargetCarbonic anhydrase 1
LigandBDBM50428425
Substrate/Competitorn/a
Meas. Tech.ChEMBL_942131 (CHEMBL2341287)
Ki 6450±n/a nM
Citation Davis, RAVullo, DMaresca, ASupuran, CTPoulsen, SA Natural product coumarins that inhibit human carbonic anhydrases. Bioorg Med Chem21:1539-43 (2013) 
 
Carbonic anhydrase 1
Name:Carbonic anhydrase 1
Type:Enzyme
Mol. Mass.:28873.37
Organism:Homo sapiens (Human)
Description:P00915
Residue:261
BDBM50428425
NameBDBM50428425
Synonyms:CHEMBL2334355
TypeSmall organic molecule
Emp. Form.C29H25NO9
Mol. Mass.531.5101
SMILESCOc1ccc(cc1O)-c1c2-c3cc(OC)c(OC)c(O)c3CCn2c2c1c1cc(OC)c(O)cc1oc2=O