Reaction Details
TargetCarbonic anhydrase 7
LigandBDBM50428432
Substrate/Competitorn/a
Meas. Tech.ChEMBL_942129 (CHEMBL2341285)
Ki 6270±n/a nM
Citation Davis, RAVullo, DMaresca, ASupuran, CTPoulsen, SA Natural product coumarins that inhibit human carbonic anhydrases. Bioorg Med Chem21:1539-43 (2013) 
 
Carbonic anhydrase 7
Name:Carbonic anhydrase 7
Type:Enzyme
Mol. Mass.:29664.11
Organism:Homo sapiens (Human)
Description:Human cloned isozyme.
Residue:264
BDBM50428432
NameBDBM50428432
Synonyms:XANTHOXYLETIN
TypeSmall organic molecule
Emp. Form.C15H14O4
Mol. Mass.258.2693
SMILESCOc1c2C=CC(C)(C)Oc2cc2oc(=O)ccc12