Reaction Details
TargetCarbonic anhydrase 1
LigandBDBM50206215
Substrate/Competitorn/a
Meas. Tech.ChEMBL_942131 (CHEMBL2341287)
Ki 4860±n/a nM
Citation Davis, RAVullo, DMaresca, ASupuran, CTPoulsen, SA Natural product coumarins that inhibit human carbonic anhydrases. Bioorg Med Chem21:1539-43 (2013) 
 
Carbonic anhydrase 1
Name:Carbonic anhydrase 1
Type:Enzyme
Mol. Mass.:28873.37
Organism:Homo sapiens (Human)
Description:P00915
Residue:261
BDBM50206215
NameBDBM50206215
Synonyms:7,8-Dihydroxy-6-methoxy-chromen-2-one CHEMBL54909 | FRAXETIN
TypeSmall organic molecule
Emp. Form.C10H8O5
Mol. Mass.208.1675
SMILESCOc1cc2ccc(=O)oc2c(O)c1O