Reaction Details
TargetCarbonic anhydrase 7
LigandBDBM50428438
Substrate/Competitorn/a
Meas. Tech.ChEMBL_942129 (CHEMBL2341285)
Ki 4530±n/a nM
Citation Davis, RAVullo, DMaresca, ASupuran, CTPoulsen, SA Natural product coumarins that inhibit human carbonic anhydrases. Bioorg Med Chem21:1539-43 (2013) 
 
Carbonic anhydrase 7
Name:Carbonic anhydrase 7
Type:Enzyme
Mol. Mass.:29664.11
Organism:Homo sapiens (Human)
Description:Human cloned isozyme.
Residue:264
BDBM50428438
NameBDBM50428438
Synonyms:CHEMBL2331585
TypeSmall organic molecule
Emp. Form.C10H8O4
Mol. Mass.192.1681
SMILESCOc1c(O)ccc2ccc(=O)oc12