Reaction Details
TargetCarbonic anhydrase 13
LigandBDBM50428422
Substrate/Competitorn/a
Meas. Tech.ChEMBL_942126 (CHEMBL2341282)
Ki 4060±n/a nM
Citation Davis, RAVullo, DMaresca, ASupuran, CTPoulsen, SA Natural product coumarins that inhibit human carbonic anhydrases. Bioorg Med Chem21:1539-43 (2013) 
 
Carbonic anhydrase 13
Name:Carbonic anhydrase 13
Type:Enzyme
Mol. Mass.:29445.78
Organism:Homo sapiens (Human)
Description:Q8N1Q1
Residue:262
BDBM50428422
NameBDBM50428422
Synonyms:CHEMBL2334352
TypeSmall organic molecule
Emp. Form.C21H19NO5
Mol. Mass.365.3793
SMILESCOc1ccc2ccc(=O)oc2c1C(COC(=O)c1cccnc1)C(C)=C