Reaction Details
TargetCarbonic anhydrase 9
LigandBDBM50428433
Substrate/Competitorn/a
Meas. Tech.ChEMBL_942128 (CHEMBL2341284)
Ki 4030±n/a nM
Citation Davis, RAVullo, DMaresca, ASupuran, CTPoulsen, SA Natural product coumarins that inhibit human carbonic anhydrases. Bioorg Med Chem21:1539-43 (2013) 
 
Carbonic anhydrase 9
Name:Carbonic anhydrase 9
Type:Enzyme
Mol. Mass.:49669.03
Organism:Homo sapiens (Human)
Description:Catalytic domain of human cloned isozyme was used in the assay
Residue:459
BDBM50428433
NameBDBM50428433
Synonyms:CHEMBL2003049
TypeSmall organic molecule
Emp. Form.C19H22O5
Mol. Mass.330.375
SMILESC\C(CCC(=O)C(C)(C)O)=C/COc1ccc2ccc(=O)oc2c1