Reaction Details
TargetCarbonic anhydrase 13
LigandBDBM50428424
Substrate/Competitorn/a
Meas. Tech.ChEMBL_942126 (CHEMBL2341282)
Ki 3700±n/a nM
Citation Davis, RAVullo, DMaresca, ASupuran, CTPoulsen, SA Natural product coumarins that inhibit human carbonic anhydrases. Bioorg Med Chem21:1539-43 (2013) 
 
Carbonic anhydrase 13
Name:Carbonic anhydrase 13
Type:Enzyme
Mol. Mass.:29445.78
Organism:Homo sapiens (Human)
Description:Q8N1Q1
Residue:262
BDBM50428424
NameBDBM50428424
Synonyms:CHEMBL2334356
TypeSmall organic molecule
Emp. Form.C30H25NO9
Mol. Mass.543.5208
SMILESCOc1cc(ccc1O)-c1c2c(n3ccc4c(OC)c(OC)c(OC)cc4c13)c(=O)oc1cc(O)c(OC)cc21