Reaction Details
TargetCarbonic anhydrase 12
LigandBDBM50428440
Substrate/Competitorn/a
Meas. Tech.ChEMBL_942127 (CHEMBL2341283)
Ki 830±n/a nM
Citation Davis, RAVullo, DMaresca, ASupuran, CTPoulsen, SA Natural product coumarins that inhibit human carbonic anhydrases. Bioorg Med Chem21:1539-43 (2013) 
 
Carbonic anhydrase 12
Name:Carbonic anhydrase 12
Type:Enzyme
Mol. Mass.:39456.00
Organism:Homo sapiens (Human)
Description:Catalytic domain of human cloned isozyme was used in the assay
Residue:354
BDBM50428440
NameBDBM50428440
Synonyms:5,7,8-Trimethoxycoumarin | CHEMBL596221
TypeSmall organic molecule
Emp. Form.C12H12O5
Mol. Mass.236.2207
SMILESCOc1cc(OC)c2ccc(=O)oc2c1OC