Reaction Details
TargetCarbonic anhydrase 12
LigandBDBM50428437
Substrate/Competitorn/a
Meas. Tech.ChEMBL_942127 (CHEMBL2341283)
Ki 810±n/a nM
Citation Davis, RAVullo, DMaresca, ASupuran, CTPoulsen, SA Natural product coumarins that inhibit human carbonic anhydrases. Bioorg Med Chem21:1539-43 (2013) 
 
Carbonic anhydrase 12
Name:Carbonic anhydrase 12
Type:Enzyme
Mol. Mass.:39456.00
Organism:Homo sapiens (Human)
Description:Catalytic domain of human cloned isozyme was used in the assay
Residue:354
BDBM50428437
NameBDBM50428437
Synonyms:(+)-CALANOLIDE B
TypeSmall organic molecule
Emp. Form.C22H26O5
Mol. Mass.370.4388
SMILESCCCc1cc(=O)oc2c3[C@H](O)[C@H](C)[C@@H](C)Oc3c3C=CC(C)(C)Oc3c12