Reaction Details
TargetCarbonic anhydrase 12
LigandBDBM50428435
Substrate/Competitorn/a
Meas. Tech.ChEMBL_942127 (CHEMBL2341283)
Ki 770±n/a nM
Citation Davis, RAVullo, DMaresca, ASupuran, CTPoulsen, SA Natural product coumarins that inhibit human carbonic anhydrases. Bioorg Med Chem21:1539-43 (2013) 
 
Carbonic anhydrase 12
Name:Carbonic anhydrase 12
Type:Enzyme
Mol. Mass.:39456.00
Organism:Homo sapiens (Human)
Description:Catalytic domain of human cloned isozyme was used in the assay
Residue:354
BDBM50428435
NameBDBM50428435
Synonyms:CHEMBL2334353
TypeSmall organic molecule
Emp. Form.C14H14O4
Mol. Mass.246.2586
SMILESC\C(CO)=C/Cc1cc2ccc(=O)oc2cc1O