Reaction Details
TargetLD26647p
LigandBDBM50382705
Substrate/Competitorn/a
Meas. Tech.ChEMBL_942137 (CHEMBL2341293)
Ki 10±n/a nM
Citation Syrjänen, LTolvanen, MEHilvo, MVullo, DCarta, FSupuran, CTParkkila, S Characterization, bioinformatic analysis and dithiocarbamate inhibition studies of two newa-carbonic anhydrases, CAH1 and CAH2, from the fruit fly Drosophila melanogaster. Bioorg Med Chem21:1516-21 (2013) 
 
LD26647p
Name:LD26647p
Type:PROTEIN
Mol. Mass.:37674.24
Organism:Drosophila melanogaster
Description:ChEMBL_942137
Residue:335
BDBM50382705
NameBDBM50382705
Synonyms:CHEMBL2023166
TypeSmall organic molecule
Emp. Form.C7H13N2OS2
Mol. Mass.205.321
SMILES[S-]C(=S)NCCN1CCOCC1