Reaction Details
TargetCarbonic anhydrase
LigandBDBM50428441
Substrate/Competitorn/a
Meas. Tech.ChEMBL_942138 (CHEMBL2341294)
Ki 13±n/a nM
Citation Syrjänen, LTolvanen, MEHilvo, MVullo, DCarta, FSupuran, CTParkkila, S Characterization, bioinformatic analysis and dithiocarbamate inhibition studies of two newa-carbonic anhydrases, CAH1 and CAH2, from the fruit fly Drosophila melanogaster. Bioorg Med Chem21:1516-21 (2013) 
 
Carbonic anhydrase
Name:Carbonic anhydrase
Type:PROTEIN
Mol. Mass.:29950.70
Organism:Drosophila melanogaster
Description:ChEMBL_942138
Residue:270
BDBM50428441
NameBDBM50428441
Synonyms:CHEMBL2334358
TypeSmall organic molecule
Emp. Form.C13H13N2S2
Mol. Mass.261.386
SMILES[S-]C(=S)N1CCC(CC1)c1ccc(cc1)C#N