Reaction Details
TargetCarbonic anhydrase
LigandBDBM50382717
Substrate/Competitorn/a
Meas. Tech.ChEMBL_942138 (CHEMBL2341294)
Ki 1.4±n/a nM
Citation Syrjänen, LTolvanen, MEHilvo, MVullo, DCarta, FSupuran, CTParkkila, S Characterization, bioinformatic analysis and dithiocarbamate inhibition studies of two newa-carbonic anhydrases, CAH1 and CAH2, from the fruit fly Drosophila melanogaster. Bioorg Med Chem21:1516-21 (2013) 
 
Carbonic anhydrase
Name:Carbonic anhydrase
Type:PROTEIN
Mol. Mass.:29950.70
Organism:Drosophila melanogaster
Description:ChEMBL_942138
Residue:270
BDBM50382717
NameBDBM50382717
Synonyms:CHEMBL2023722
TypeSmall organic molecule
Emp. Form.C13H26NS2
Mol. Mass.260.483
SMILESCCCCCCN(CCCCCC)C([S-])=S