Reaction Details
TargetCarbonic anhydrase
LigandBDBM50382711
Substrate/Competitorn/a
Meas. Tech.ChEMBL_942138 (CHEMBL2341294)
Ki 0.900000±n/a nM
Citation Syrjänen, LTolvanen, MEHilvo, MVullo, DCarta, FSupuran, CTParkkila, S Characterization, bioinformatic analysis and dithiocarbamate inhibition studies of two newa-carbonic anhydrases, CAH1 and CAH2, from the fruit fly Drosophila melanogaster. Bioorg Med Chem21:1516-21 (2013) 
 
Carbonic anhydrase
Name:Carbonic anhydrase
Type:PROTEIN
Mol. Mass.:29950.70
Organism:Drosophila melanogaster
Description:ChEMBL_942138
Residue:270
BDBM50382711
NameBDBM50382711
Synonyms:CHEMBL2023718 | CHEMBL2334361
TypeSmall organic molecule
Emp. Form.C7H10N3S2
Mol. Mass.200.305
SMILES[S-]C(=S)NCCCn1ccnc1