Reaction Details
TargetCarbonic anhydrase 2
LigandBDBM50426825
Substrate/Competitorn/a
Meas. Tech.ChEMBL_942148 (CHEMBL2341304)
Ki 7800±n/a nM
Citation Riafrecha, LERodríguez, OMVullo, DSupuran, CTColinas, PA Synthesis of C-cinnamoyl glycosides and their inhibitory activity against mammalian carbonic anhydrases. Bioorg Med Chem21:1489-94 (2013) 
 
Carbonic anhydrase 2
Name:Carbonic anhydrase 2
Type:Enzyme
Mol. Mass.:29250.71
Organism:Homo sapiens (Human)
Description:P00918
Residue:260
BDBM50426825
NameBDBM50426825
Synonyms:CHEMBL2323138
TypeSmall organic molecule
Emp. Form.C16H20O7
Mol. Mass.324.3258
SMILESOC[C@H]1O[C@@H](CC(=O)C=Cc2cccc(O)c2)[C@H](O)[C@@H](O)[C@@H]1O