Reaction Details
TargetCarbonic anhydrase 7
LigandBDBM50426824
Substrate/Competitorn/a
Meas. Tech.ChEMBL_942143 (CHEMBL2341299)
Ki 9000±n/a nM
Citation Riafrecha, LERodríguez, OMVullo, DSupuran, CTColinas, PA Synthesis of C-cinnamoyl glycosides and their inhibitory activity against mammalian carbonic anhydrases. Bioorg Med Chem21:1489-94 (2013) 
 
Carbonic anhydrase 7
Name:Carbonic anhydrase 7
Type:Enzyme
Mol. Mass.:29664.11
Organism:Homo sapiens (Human)
Description:Human cloned isozyme.
Residue:264
BDBM50426824
NameBDBM50426824
Synonyms:CHEMBL2323139
TypeSmall organic molecule
Emp. Form.C16H20O7
Mol. Mass.324.3258
SMILESOC[C@H]1O[C@@H](CC(=O)C=Cc2cccc(O)c2)[C@H](O)[C@@H](O)[C@H]1O