Reaction Details
TargetCarbonic anhydrase 3
LigandBDBM26187
Substrate/Competitorn/a
Meas. Tech.ChEMBL_942149 (CHEMBL2341305)
Ki 2700±n/a nM
Citation Riafrecha, LERodríguez, OMVullo, DSupuran, CTColinas, PA Synthesis of C-cinnamoyl glycosides and their inhibitory activity against mammalian carbonic anhydrases. Bioorg Med Chem21:1489-94 (2013) 
 
Carbonic anhydrase 3
Name:Carbonic anhydrase 3
Type:Enzyme
Mol. Mass.:29562.11
Organism:Homo sapiens (Human)
Description:Human cloned isozyme.
Residue:260
BDBM26187
NameBDBM26187
Synonyms:α-CA inhibitor, 11 US9688816, 2 | phenol
TypeSmall organic molecule
Emp. Form.C6H6O
Mol. Mass.94.1112
SMILESOc1ccccc1