Reaction Details
TargetCarbonic anhydrase 13
LigandBDBM50426828
Substrate/Competitorn/a
Meas. Tech.ChEMBL_942140 (CHEMBL2341296)
Ki 4900±n/a nM
Citation Riafrecha, LERodríguez, OMVullo, DSupuran, CTColinas, PA Synthesis of C-cinnamoyl glycosides and their inhibitory activity against mammalian carbonic anhydrases. Bioorg Med Chem21:1489-94 (2013) 
 
Carbonic anhydrase 13
Name:Carbonic anhydrase 13
Type:Enzyme
Mol. Mass.:29445.78
Organism:Homo sapiens (Human)
Description:Q8N1Q1
Residue:262
BDBM50426828
NameBDBM50426828
Synonyms:CHEMBL2323135
TypeSmall organic molecule
Emp. Form.C24H28O11
Mol. Mass.492.4725
SMILESCC(=O)OC[C@H]1O[C@@H](CC(=O)C=Cc2ccc(O)cc2)[C@H](OC(C)=O)[C@@H](OC(C)=O)[C@@H]1OC(C)=O