Reaction Details
TargetCarbonic anhydrase 12
LigandBDBM26192
Substrate/Competitorn/a
Meas. Tech.ChEMBL_942151 (CHEMBL2341307)
Ki 70220±n/a nM
Citation Tuccinardi, TBertini, SGranchi, COrtore, GMacchia, MMinutolo, FMartinelli, ASupuran, CT Salicylaldoxime derivatives as new leads for the development of carbonic anhydrase inhibitors. Bioorg Med Chem21:1511-5 (2013) 
 
Carbonic anhydrase 12
Name:Carbonic anhydrase 12
Type:Enzyme
Mol. Mass.:39456.00
Organism:Homo sapiens (Human)
Description:Catalytic domain of human cloned isozyme was used in the assay
Residue:354
BDBM26192
NameBDBM26192
Synonyms:3,5-difluorophenol | phenol derivative, 6
TypeSmall organic molecule
Emp. Form.C6H4F2O
Mol. Mass.130.0922
SMILESOc1cc(F)cc(F)c1