Reaction Details
TargetCarbonic anhydrase 1
LigandBDBM50428447
Substrate/Competitorn/a
Meas. Tech.ChEMBL_942154 (CHEMBL2341787)
Ki 6900±n/a nM
Citation Tuccinardi, TBertini, SGranchi, COrtore, GMacchia, MMinutolo, FMartinelli, ASupuran, CT Salicylaldoxime derivatives as new leads for the development of carbonic anhydrase inhibitors. Bioorg Med Chem21:1511-5 (2013) 
 
Carbonic anhydrase 1
Name:Carbonic anhydrase 1
Type:Enzyme
Mol. Mass.:28873.37
Organism:Homo sapiens (Human)
Description:P00915
Residue:261
BDBM50428447
NameBDBM50428447
Synonyms:CHEMBL479638
TypeSmall organic molecule
Emp. Form.C14H12ClNO3
Mol. Mass.277.703
SMILESCC(N=O)c1ccc(-c2ccc(O)cc2)c(Cl)c1O