Reaction Details
TargetCarbonic anhydrase 9
LigandBDBM50387131
Substrate/Competitorn/a
Meas. Tech.ChEMBL_943445 (CHEMBL2341889)
Ki 7.0±n/a nM
Citation Gieling, RGWilliams, KJ Carbonic anhydrase IX as a target for metastatic disease. Bioorg Med Chem21:1470-6 (2013) 
 
Carbonic anhydrase 9
Name:Carbonic anhydrase 9
Type:Enzyme
Mol. Mass.:49669.03
Organism:Homo sapiens (Human)
Description:Catalytic domain of human cloned isozyme was used in the assay
Residue:459
BDBM50387131
NameBDBM50387131
Synonyms:4-ureidophenyl sulfamate ring derivative 3p | CHEMBL2047811
TypeSmall organic molecule
Emp. Form.C15H17N3O4S
Mol. Mass.335.378
SMILESCc1cc(C)cc(NC(=O)Nc2ccc(OS(N)(=O)=O)cc2)c1