Reaction Details
TargetAndrogen receptor
LigandBDBM50428557
Substrate/Competitorn/a
Meas. Tech.ChEMBL_944553 (CHEMBL2339069)
IC50 370±n/a nM
Citation Yamamoto, SKobayashi, HKaku, TAikawa, KHara, TYamaoka, MKanzaki, NHasuoka, ABaba, AIto, M Design, synthesis, and biological evaluation of 3-aryl-3-hydroxy-1-phenylpyrrolidine derivatives as novel androgen receptor antagonists. Bioorg Med Chem21:70-83 (2012) 
 
Androgen receptor
Name:Androgen receptor
Type:Receptor
Mol. Mass.:99185.27
Organism:Homo sapiens (Human)
Description:CHO cells were stably transfected with human AR gene.
Residue:920
BDBM50428557
NameBDBM50428557
Synonyms:CHEMBL2337507
TypeSmall organic molecule
Emp. Form.C17H15ClN2O
Mol. Mass.298.767
SMILESOC1(CCN(C1)c1ccc(C#N)c(Cl)c1)c1ccccc1