Reaction Details
TargetAndrogen receptor
LigandBDBM50428552
Substrate/Competitorn/a
Meas. Tech.ChEMBL_944551 (CHEMBL2339067)
IC50 120±n/a nM
Citation Yamamoto, SKobayashi, HKaku, TAikawa, KHara, TYamaoka, MKanzaki, NHasuoka, ABaba, AIto, M Design, synthesis, and biological evaluation of 3-aryl-3-hydroxy-1-phenylpyrrolidine derivatives as novel androgen receptor antagonists. Bioorg Med Chem21:70-83 (2012) 
 
Androgen receptor
Name:Androgen receptor
Type:Receptor
Mol. Mass.:99185.27
Organism:Homo sapiens (Human)
Description:CHO cells were stably transfected with human AR gene.
Residue:920
BDBM50428552
NameBDBM50428552
Synonyms:CHEMBL2337512
TypeSmall organic molecule
Emp. Form.C19H19ClN4O2
Mol. Mass.370.833
SMILESCNC(=O)c1ccc(nc1)[C@]1(O)CCN([C@H]1C)c1ccc(C#N)c(Cl)c1