Reaction Details
TargetAndrogen receptor
LigandBDBM50428553
Substrate/Competitorn/a
Meas. Tech.ChEMBL_944551 (CHEMBL2339067)
IC50 8.6±n/a nM
Citation Yamamoto, SKobayashi, HKaku, TAikawa, KHara, TYamaoka, MKanzaki, NHasuoka, ABaba, AIto, M Design, synthesis, and biological evaluation of 3-aryl-3-hydroxy-1-phenylpyrrolidine derivatives as novel androgen receptor antagonists. Bioorg Med Chem21:70-83 (2012) 
 
Androgen receptor
Name:Androgen receptor
Type:Receptor
Mol. Mass.:99185.27
Organism:Homo sapiens (Human)
Description:CHO cells were stably transfected with human AR gene.
Residue:920
BDBM50428553
NameBDBM50428553
Synonyms:CHEMBL2337511
TypeSmall organic molecule
Emp. Form.C20H20ClN3O2
Mol. Mass.369.845
SMILESCNC(=O)c1ccc(cc1)[C@]1(O)CCN([C@H]1C)c1ccc(C#N)c(Cl)c1