Reaction Details
TargetVoltage-dependent T-type calcium channel subunit alpha-1H
LigandBDBM50117922
Substrate/Competitorn/a
Meas. Tech.ChEMBL_945536 (CHEMBL2344013)
IC50 1000±n/a nM
Citation Giordanetto, FWållberg, AKnerr, LSelmi, NUllah, VThorstensson, FLindelöf, ÅKarlsson, SNikitidis, GLlinas, AWang, QDLindqvist, AHögberg, GLindhardt, EÅstrand, ADuker, G Discovery of N-[[1-[2-(tert-butylcarbamoylamino)ethyl]-4-(hydroxymethyl)-4-piperidyl]methyl]-3,5-dichloro-benzamide as a selective T-type calcium channel (Cav3.2) inhibitor. Bioorg Med Chem Lett23:119-24 (2012) 
 
Voltage-dependent T-type calcium channel subunit alpha-1H
Name:Voltage-dependent T-type calcium channel subunit alpha-1H
Type:Enzyme Catalytic Domain
Mol. Mass.:259187.68
Organism:Homo sapiens (Human)
Description:Calcium channel (Type T,L) 0 0::O95180
Residue:2353
BDBM50117922
NameBDBM50117922
Synonyms:(1S,2S)-2-(2-((3-(1H-benzo[d]imidazol-2-yl)propyl)(methyl)amino)ethyl)-6-fluoro-1-isopropyl-1,2,3,4-tetrahydronaphthalen-2-yl 2-methoxyacetate CHEMBL45816 Methoxy-acetic acid (1S,2S)-2-(2-{[3-(1H-benzoimidazol-2-yl)-propyl]-methyl-amino}-ethyl)-6-fluoro-1-isopropyl-1,2,3,4-tetrahydro-naphthalen-2-yl ester Mibefradil dihydrochloride
TypeSmall organic molecule
Emp. Form.C29H38FN3O3
Mol. Mass.495.6287
SMILESCOCC(=O)O[C@]1(CCN(C)CCCc2nc3ccccc3[nH]2)CCc2cc(F)ccc2[C@@H]1C(C)C