Reaction Details
TargetCarbonic anhydrase 2
LigandBDBM50387160
Substrate/Competitorn/a
Meas. Tech.ChEMBL_946061 (CHEMBL2342098)
Ki 216±n/a nM
Citation Tarko, LSupuran, CT QSAR studies of sulfamate and sulfamide inhibitors targeting human carbonic anhydrase isozymes I, II, IX and XII. Bioorg Med Chem21:1404-9 (2013) 
 
Carbonic anhydrase 2
Name:Carbonic anhydrase 2
Type:Enzyme
Mol. Mass.:29250.71
Organism:Homo sapiens (Human)
Description:P00918
Residue:260
BDBM50387160
NameBDBM50387160
Synonyms:4-ureidophenyl sulfamate ring derivative 3ay | CHEMBL2047841
TypeSmall organic molecule
Emp. Form.C13H15N3O4S2
Mol. Mass.341.406
SMILESNS(=O)(=O)Oc1ccc(NC(=O)NCCc2cccs2)cc1