Reaction Details
TargetCarbonic anhydrase 2
LigandBDBM50387159
Substrate/Competitorn/a
Meas. Tech.ChEMBL_946061 (CHEMBL2342098)
Ki 342±n/a nM
Citation Tarko, LSupuran, CT QSAR studies of sulfamate and sulfamide inhibitors targeting human carbonic anhydrase isozymes I, II, IX and XII. Bioorg Med Chem21:1404-9 (2013) 
 
Carbonic anhydrase 2
Name:Carbonic anhydrase 2
Type:Enzyme
Mol. Mass.:29250.71
Organism:Homo sapiens (Human)
Description:P00918
Residue:260
BDBM50387159
NameBDBM50387159
Synonyms:4-ureidophenyl sulfamate ring derivative 3ax | CHEMBL2047840
TypeSmall organic molecule
Emp. Form.C19H19N3O4S
Mol. Mass.385.437
SMILESNS(=O)(=O)Oc1ccc(NC(=O)NCCc2cccc3ccccc23)cc1