Reaction Details
TargetCarbonic anhydrase 2
LigandBDBM50387134
Substrate/Competitorn/a
Meas. Tech.ChEMBL_946061 (CHEMBL2342098)
Ki 682±n/a nM
Citation Tarko, LSupuran, CT QSAR studies of sulfamate and sulfamide inhibitors targeting human carbonic anhydrase isozymes I, II, IX and XII. Bioorg Med Chem21:1404-9 (2013) 
 
Carbonic anhydrase 2
Name:Carbonic anhydrase 2
Type:Enzyme
Mol. Mass.:29250.71
Organism:Homo sapiens (Human)
Description:P00918
Residue:260
BDBM50387134
NameBDBM50387134
Synonyms:4-ureidophenyl sulfamate ring derivative 3s | CHEMBL2047814
TypeSmall organic molecule
Emp. Form.C13H10BrF2N3O4S
Mol. Mass.422.202
SMILESNS(=O)(=O)Oc1ccc(NC(=O)Nc2c(F)cc(F)cc2Br)cc1