Reaction Details
TargetCarbonic anhydrase 2
LigandBDBM50387128
Substrate/Competitorn/a
Meas. Tech.ChEMBL_946061 (CHEMBL2342098)
Ki 430±n/a nM
Citation Tarko, LSupuran, CT QSAR studies of sulfamate and sulfamide inhibitors targeting human carbonic anhydrase isozymes I, II, IX and XII. Bioorg Med Chem21:1404-9 (2013) 
 
Carbonic anhydrase 2
Name:Carbonic anhydrase 2
Type:Enzyme
Mol. Mass.:29250.71
Organism:Homo sapiens (Human)
Description:P00918
Residue:260
BDBM50387128
NameBDBM50387128
Synonyms:4-ureidophenyl sulfamate ring derivative 3m | CHEMBL2047808
TypeSmall organic molecule
Emp. Form.C13H12N4O6S
Mol. Mass.352.323
SMILESNS(=O)(=O)Oc1ccc(NC(=O)Nc2ccc(cc2)[N+]([O-])=O)cc1