Reaction Details
TargetCarbonic anhydrase 1
LigandBDBM50428614
Substrate/Competitorn/a
Meas. Tech.ChEMBL_946062 (CHEMBL2342099)
Ki 4300±n/a nM
Citation Tarko, LSupuran, CT QSAR studies of sulfamate and sulfamide inhibitors targeting human carbonic anhydrase isozymes I, II, IX and XII. Bioorg Med Chem21:1404-9 (2013) 
 
Carbonic anhydrase 1
Name:Carbonic anhydrase 1
Type:Enzyme
Mol. Mass.:28873.37
Organism:Homo sapiens (Human)
Description:P00915
Residue:261
BDBM50428614
NameBDBM50428614
Synonyms:CHEMBL2331760
TypeSmall organic molecule
Emp. Form.C14H15ClN4O3S
Mol. Mass.354.812
SMILESCc1cc(Cl)ccc1NC(=O)Nc1ccc(NS(N)(=O)=O)cc1