Reaction Details
TargetCarbonic anhydrase 1
LigandBDBM50428622
Substrate/Competitorn/a
Meas. Tech.ChEMBL_946062 (CHEMBL2342099)
Ki 3416±n/a nM
Citation Tarko, LSupuran, CT QSAR studies of sulfamate and sulfamide inhibitors targeting human carbonic anhydrase isozymes I, II, IX and XII. Bioorg Med Chem21:1404-9 (2013) 
 
Carbonic anhydrase 1
Name:Carbonic anhydrase 1
Type:Enzyme
Mol. Mass.:28873.37
Organism:Homo sapiens (Human)
Description:P00915
Residue:261
BDBM50428622
NameBDBM50428622
Synonyms:CHEMBL2331767
TypeSmall organic molecule
Emp. Form.C15H18N4O4S
Mol. Mass.350.393
SMILESCOc1ccc(NC(=O)Nc2ccc(NS(N)(=O)=O)cc2)c(C)c1