Reaction Details
TargetCarbonic anhydrase 1
LigandBDBM50387139
Substrate/Competitorn/a
Meas. Tech.ChEMBL_946062 (CHEMBL2342099)
Ki 2713±n/a nM
Citation Tarko, LSupuran, CT QSAR studies of sulfamate and sulfamide inhibitors targeting human carbonic anhydrase isozymes I, II, IX and XII. Bioorg Med Chem21:1404-9 (2013) 
 
Carbonic anhydrase 1
Name:Carbonic anhydrase 1
Type:Enzyme
Mol. Mass.:28873.37
Organism:Homo sapiens (Human)
Description:P00915
Residue:261
BDBM50387139
NameBDBM50387139
Synonyms:CHEMBL2047819
TypeSmall organic molecule
Emp. Form.C13H11F2N3O4S
Mol. Mass.343.306
SMILESNS(=O)(=O)Oc1ccc(NC(=O)Nc2ccc(F)cc2F)cc1