Reaction Details
TargetCarbonic anhydrase 12
LigandBDBM50387119
Substrate/Competitorn/a
Meas. Tech.ChEMBL_946059 (CHEMBL2342096)
Ki 34±n/a nM
Citation Tarko, LSupuran, CT QSAR studies of sulfamate and sulfamide inhibitors targeting human carbonic anhydrase isozymes I, II, IX and XII. Bioorg Med Chem21:1404-9 (2013) 
 
Carbonic anhydrase 12
Name:Carbonic anhydrase 12
Type:Enzyme
Mol. Mass.:39456.00
Organism:Homo sapiens (Human)
Description:Catalytic domain of human cloned isozyme was used in the assay
Residue:354
BDBM50387119
NameBDBM50387119
Synonyms:4-ureidophenyl sulfamate ring derivative 3an | CHEMBL2047832
TypeSmall organic molecule
Emp. Form.C16H19N3O4S
Mol. Mass.349.405
SMILESCC(C)c1ccccc1NC(=O)Nc1ccc(OS(N)(=O)=O)cc1