Reaction Details
TargetCarbonic anhydrase 12
LigandBDBM50387146
Substrate/Competitorn/a
Meas. Tech.ChEMBL_946059 (CHEMBL2342096)
Ki 14±n/a nM
Citation Tarko, LSupuran, CT QSAR studies of sulfamate and sulfamide inhibitors targeting human carbonic anhydrase isozymes I, II, IX and XII. Bioorg Med Chem21:1404-9 (2013) 
 
Carbonic anhydrase 12
Name:Carbonic anhydrase 12
Type:Enzyme
Mol. Mass.:39456.00
Organism:Homo sapiens (Human)
Description:Catalytic domain of human cloned isozyme was used in the assay
Residue:354
BDBM50387146
NameBDBM50387146
Synonyms:CHEMBL2047826
TypeSmall organic molecule
Emp. Form.C20H19N3O5S
Mol. Mass.413.447
SMILESNS(=O)(=O)Oc1ccc(NC(=O)Nc2ccc(OCc3ccccc3)cc2)cc1