Reaction Details
TargetCarbonic anhydrase 12
LigandBDBM50387143
Substrate/Competitorn/a
Meas. Tech.ChEMBL_946059 (CHEMBL2342096)
Ki 86±n/a nM
Citation Tarko, LSupuran, CT QSAR studies of sulfamate and sulfamide inhibitors targeting human carbonic anhydrase isozymes I, II, IX and XII. Bioorg Med Chem21:1404-9 (2013) 
 
Carbonic anhydrase 12
Name:Carbonic anhydrase 12
Type:Enzyme
Mol. Mass.:39456.00
Organism:Homo sapiens (Human)
Description:Catalytic domain of human cloned isozyme was used in the assay
Residue:354
BDBM50387143
NameBDBM50387143
Synonyms:CHEMBL2047823
TypeSmall organic molecule
Emp. Form.C19H17N3O5S
Mol. Mass.399.42
SMILESNS(=O)(=O)Oc1ccc(NC(=O)Nc2cccc(Oc3ccccc3)c2)cc1