Reaction Details
TargetCarbonic anhydrase 9
LigandBDBM50428615
Substrate/Competitorn/a
Meas. Tech.ChEMBL_946060 (CHEMBL2342097)
Ki 108±n/a nM
Citation Tarko, LSupuran, CT QSAR studies of sulfamate and sulfamide inhibitors targeting human carbonic anhydrase isozymes I, II, IX and XII. Bioorg Med Chem21:1404-9 (2013) 
 
Carbonic anhydrase 9
Name:Carbonic anhydrase 9
Type:Enzyme
Mol. Mass.:49669.03
Organism:Homo sapiens (Human)
Description:Catalytic domain of human cloned isozyme was used in the assay
Residue:459
BDBM50428615
NameBDBM50428615
Synonyms:CHEMBL2331759
TypeSmall organic molecule
Emp. Form.C13H20N4O3S
Mol. Mass.312.388
SMILESNS(=O)(=O)Nc1ccc(NC(=O)NC2CCCCC2)cc1