Reaction Details
TargetCarbonic anhydrase 9
LigandBDBM50428623
Substrate/Competitorn/a
Meas. Tech.ChEMBL_946060 (CHEMBL2342097)
Ki 11±n/a nM
Citation Tarko, LSupuran, CT QSAR studies of sulfamate and sulfamide inhibitors targeting human carbonic anhydrase isozymes I, II, IX and XII. Bioorg Med Chem21:1404-9 (2013) 
 
Carbonic anhydrase 9
Name:Carbonic anhydrase 9
Type:Enzyme
Mol. Mass.:49669.03
Organism:Homo sapiens (Human)
Description:Catalytic domain of human cloned isozyme was used in the assay
Residue:459
BDBM50428623
NameBDBM50428623
Synonyms:CHEMBL2331766
TypeSmall organic molecule
Emp. Form.C15H18N4O3S
Mol. Mass.334.393
SMILESCc1cc(C)cc(NC(=O)Nc2ccc(NS(N)(=O)=O)cc2)c1