Reaction Details
TargetCarbonic anhydrase 9
LigandBDBM50387144
Substrate/Competitorn/a
Meas. Tech.ChEMBL_946060 (CHEMBL2342097)
Ki 14±n/a nM
Citation Tarko, LSupuran, CT QSAR studies of sulfamate and sulfamide inhibitors targeting human carbonic anhydrase isozymes I, II, IX and XII. Bioorg Med Chem21:1404-9 (2013) 
 
Carbonic anhydrase 9
Name:Carbonic anhydrase 9
Type:Enzyme
Mol. Mass.:49669.03
Organism:Homo sapiens (Human)
Description:Catalytic domain of human cloned isozyme was used in the assay
Residue:459
BDBM50387144
NameBDBM50387144
Synonyms:CHEMBL2047824
TypeSmall organic molecule
Emp. Form.C15H15N3O5S
Mol. Mass.349.362
SMILESCC(=O)c1ccc(NC(=O)Nc2ccc(OS(N)(=O)=O)cc2)cc1