Reaction Details
TargetCarbonic anhydrase 9
LigandBDBM50387142
Substrate/Competitorn/a
Meas. Tech.ChEMBL_946060 (CHEMBL2342097)
Ki 86±n/a nM
Citation Tarko, LSupuran, CT QSAR studies of sulfamate and sulfamide inhibitors targeting human carbonic anhydrase isozymes I, II, IX and XII. Bioorg Med Chem21:1404-9 (2013) 
 
Carbonic anhydrase 9
Name:Carbonic anhydrase 9
Type:Enzyme
Mol. Mass.:49669.03
Organism:Homo sapiens (Human)
Description:Catalytic domain of human cloned isozyme was used in the assay
Residue:459
BDBM50387142
NameBDBM50387142
Synonyms:CHEMBL2047822
TypeSmall organic molecule
Emp. Form.C19H17N3O5S
Mol. Mass.399.42
SMILESNS(=O)(=O)Oc1ccc(NC(=O)Nc2ccccc2Oc2ccccc2)cc1