Reaction Details
TargetCarbonic anhydrase 9
LigandBDBM50387134
Substrate/Competitorn/a
Meas. Tech.ChEMBL_946060 (CHEMBL2342097)
Ki 9±n/a nM
Citation Tarko, LSupuran, CT QSAR studies of sulfamate and sulfamide inhibitors targeting human carbonic anhydrase isozymes I, II, IX and XII. Bioorg Med Chem21:1404-9 (2013) 
 
Carbonic anhydrase 9
Name:Carbonic anhydrase 9
Type:Enzyme
Mol. Mass.:49669.03
Organism:Homo sapiens (Human)
Description:Catalytic domain of human cloned isozyme was used in the assay
Residue:459
BDBM50387134
NameBDBM50387134
Synonyms:4-ureidophenyl sulfamate ring derivative 3s | CHEMBL2047814
TypeSmall organic molecule
Emp. Form.C13H10BrF2N3O4S
Mol. Mass.422.202
SMILESNS(=O)(=O)Oc1ccc(NC(=O)Nc2c(F)cc(F)cc2Br)cc1