Reaction Details
TargetBcl-2-like protein 1
LigandBDBM50428720
Substrate/Competitorn/a
Meas. Tech.ChEMBL_947461 (CHEMBL2345537)
Ki 500±n/a nM
Citation Zhang, ZSong, TLi, XWu, ZFeng, YXie, FLiu, CQin, JChen, H Novel soluble myeloid cell leukemia sequence 1 (Mcl-1) inhibitor (E,E)-2-(benzylaminocarbonyl)-3-styrylacrylonitrile (4g) developed using a fragment-based approach. Eur J Med Chem59:141-9 (2013) 
 
Bcl-2-like protein 1
Name:Bcl-2-like protein 1
Type:Mitochondrion membrane; Single-pass membrane protein
Mol. Mass.:26039.60
Organism:Homo sapiens (Human)
Description:n/a
Residue:233
BDBM50428720
NameBDBM50428720
Synonyms:CHEMBL2333140
TypeSmall organic molecule
Emp. Form.C20H13ClN2O4S
Mol. Mass.412.846
SMILESNC(=O)c1ccccc1C(=O)c1ccc(Sc2ccc(Cl)cc2)c(c1)[N+]([O-])=O