Reaction Details
TargetBcl-2-like protein 1
LigandBDBM50428721
Substrate/Competitorn/a
Meas. Tech.ChEMBL_947461 (CHEMBL2345537)
Ki 21±n/a nM
Citation Zhang, ZSong, TLi, XWu, ZFeng, YXie, FLiu, CQin, JChen, H Novel soluble myeloid cell leukemia sequence 1 (Mcl-1) inhibitor (E,E)-2-(benzylaminocarbonyl)-3-styrylacrylonitrile (4g) developed using a fragment-based approach. Eur J Med Chem59:141-9 (2013) 
 
Bcl-2-like protein 1
Name:Bcl-2-like protein 1
Type:Mitochondrion membrane; Single-pass membrane protein
Mol. Mass.:26039.60
Organism:Homo sapiens (Human)
Description:n/a
Residue:233
BDBM50428721
NameBDBM50428721
Synonyms:CHEMBL2333155
TypeSmall organic molecule
Emp. Form.C41H42ClN5O5S2
Mol. Mass.784.386
SMILESCCCC(CSc1ccccc1)Nc1ccc(cc1[N+]([O-])=O)S(=O)(=O)NC(=O)c1ccc(cc1)N1CCN(Cc2ccccc2-c2ccc(Cl)cc2)CC1