Reaction Details
TargetBcl-2-like protein 1
LigandBDBM50428722
Substrate/Competitorn/a
Meas. Tech.ChEMBL_947461 (CHEMBL2345537)
Ki 4100±n/a nM
Citation Zhang, ZSong, TLi, XWu, ZFeng, YXie, FLiu, CQin, JChen, H Novel soluble myeloid cell leukemia sequence 1 (Mcl-1) inhibitor (E,E)-2-(benzylaminocarbonyl)-3-styrylacrylonitrile (4g) developed using a fragment-based approach. Eur J Med Chem59:141-9 (2013) 
 
Bcl-2-like protein 1
Name:Bcl-2-like protein 1
Type:Mitochondrion membrane; Single-pass membrane protein
Mol. Mass.:26039.60
Organism:Homo sapiens (Human)
Description:n/a
Residue:233
BDBM50428722
NameBDBM50428722
Synonyms:CHEMBL2333154
TypeSmall organic molecule
Emp. Form.C19H11BrCl3NO4S
Mol. Mass.535.623
SMILESOc1c(Br)cc(Cl)cc1C(=O)Nc1cc(ccc1Cl)S(=O)(=O)c1ccc(Cl)cc1