Reaction Details
TargetBcl-2-like protein 1
LigandBDBM85273
Substrate/Competitorn/a
Meas. Tech.ChEMBL_947461 (CHEMBL2345537)
Ki 5100±n/a nM
Citation Zhang, ZSong, TLi, XWu, ZFeng, YXie, FLiu, CQin, JChen, H Novel soluble myeloid cell leukemia sequence 1 (Mcl-1) inhibitor (E,E)-2-(benzylaminocarbonyl)-3-styrylacrylonitrile (4g) developed using a fragment-based approach. Eur J Med Chem59:141-9 (2013) 
 
Bcl-2-like protein 1
Name:Bcl-2-like protein 1
Type:Mitochondrion membrane; Single-pass membrane protein
Mol. Mass.:26039.60
Organism:Homo sapiens (Human)
Description:n/a
Residue:233
BDBM85273
NameBDBM85273
Synonyms:BI-21C5
TypeSmall organic molecule
Emp. Form.C19H12N2O4
Mol. Mass.332.3096
SMILESOc1ccccc1-c1cc(-c2ccc3OCOc3c2)c(C#N)c(=O)[nH]1